RDF description of 情報ネットワークの情報提供方法
primary topic: 情報ネットワークの情報提供方法

情報ネットワークの情報提供方法
type: TerminologyConcept
in scheme: TerminologyConceptScheme
top concept of: TerminologyConceptScheme
broader: Ta00545
created: 2017-12-01
description: 施設における事業実施のための、一般の人々に対する情報提供方法の別。データベースやホームページを構築し、インターネットやメールマガジン等を活用している場合に限る。