社会教育関係職員数
type: TerminologyConcept
description: 教育委員会事務局の職員として発令されている者のうち、文部科学省生涯学習政策局の掌握事務に直結した諸事務を主として行っている社会教育関係課の職員の人数。
created: 2017-12-01
broader: Ta00118
top concept of: TerminologyConceptScheme
in scheme: TerminologyConceptScheme

RDF description of 社会教育関係職員数
primary topic: 社会教育関係職員数