RDF description of 震災による転居の理由
primary topic: 震災による転居の理由

震災による転居の理由
type: TerminologyConcept
in scheme: TerminologyConceptScheme
top concept of: TerminologyConceptScheme
broader: Ta00659
created: 2017-12-01
description: 地震及びこれに伴う原子力発電所の事故による災害に起因して最初に「転居した」際の主な理由。「住宅に住めなくなった」とは、住宅が半壊又は全壊した、居住地域が避難地域に指定されたことなどにより住宅に住めなくなった場合をいう。上記以外で、例えば、就学や仕事の関係、生活への全般的不安感などが理由で転居した場合をいう。