RDF description of 定昇・ベースアップ等の追給額
primary topic: 定昇・ベースアップ等の追給額

定昇・ベースアップ等の追給額
type: TerminologyConcept
in scheme: TerminologyConceptScheme
top concept of: TerminologyConceptScheme
broader: Ta00088
created: 2017-12-01
description: 労働協約又は就業規則等の改定によって給与の支給条件・算定方法が変更され、在籍労働者全員又は大多数のきまって支給する給与の全部又は一部を増額する場合における新算定方法による給与と既に支払い済みの給与との差額の追加支給分の額。