RDF description of 地方選定養殖種類
primary topic: 地方選定養殖種類

地方選定養殖種類
type: TerminologyConcept
in scheme: TerminologyConceptScheme
top concept of: TerminologyConceptScheme
broader: Ta00612
created: 2017-12-01
description: 漁業経営体が過去１年間に営んだすべての地方選定養殖種類の名称。地方選定養殖種類名は、地域における養殖種類を都道府県別に独自に細分化したものをいう。