RDF description of 地方選定魚種
primary topic: 地方選定魚種

地方選定魚種
type: TerminologyConcept
description: 漁業経営体が過去１年間に漁獲又は収獲している魚等の種類。地方選定魚種名は、地域における漁獲魚種を都道府県別に独自に細分化したもの。
created: 2017-12-01
broader: Ta00612
in scheme: TerminologyConceptScheme
top concept of: TerminologyConceptScheme