医療機器・再生医療等製品の用途区分
type: TerminologyConcept
description: １．主要部品に輸入品を使用していない医療機器及び再生医療等製品、２．主要部品に輸入品を使用している医療機器及び再生医療等製品、３．完成品として輸入された医療機器及び再生医療等製品、のいずれかを特定するもの。
created: 2017-12-01
broader: Ta00584
in scheme: TerminologyConceptScheme
top concept of: TerminologyConceptScheme

RDF description of 医療機器・再生医療等製品の用途区分
primary topic: 医療機器・再生医療等製品の用途区分