RDF description of 土地の取得・売却などの有無
primary topic: 土地の取得・売却などの有無

土地の取得・売却などの有無
type: TerminologyConcept
in scheme: TerminologyConceptScheme
top concept of: TerminologyConceptScheme
broader: Ta00648
created: 2017-12-01
description: 調査期間において、土地の取得・売却などの有無。「取得・売却など」には、購入及び売却以外の要因で、土地の面積または帳簿価格が増減した場合を含む。