敷地の権原
type: TerminologyConcept
description: 建物の敷地の権原形態。単独所有であるか、共有であるか、借地であるかの別並びに共有である場合の建物の区分所有による土地の共有かそれ以外かの別及び借地である場合の普通借地か定期借地の別によって区分したもの。
created: 2017-12-01
broader: Ta00570
top concept of: TerminologyConceptScheme
in scheme: TerminologyConceptScheme

RDF description of 敷地の権原
primary topic: 敷地の権原