建物の所有の有無
type: TerminologyConcept
description: 法人の建物の所有の有無。法人が「所有している」建物とは、当該法人が不動産の登記簿上の名義人となっているものをいう。共有名義である場合も含む。（最近取得して）登記がまだ済んでいない場合や、分割払いなどで支払が完了していない場合も含む。
created: 2017-12-01
broader: Ta00570
top concept of: TerminologyConceptScheme
in scheme: TerminologyConceptScheme

RDF description of 建物の所有の有無
primary topic: 建物の所有の有無