歯科用アマルガムの保有状況
type: TerminologyConcept
description: 治療のために、歯に充填される歯科治療材料で、銀・スズ・銅・亜鉛・水銀等が含まれる合金の保有の有無。
created: 2017-12-01
broader: Ta00644
top concept of: TerminologyConceptScheme
in scheme: TerminologyConceptScheme

RDF description of 歯科用アマルガムの保有状況
primary topic: 歯科用アマルガムの保有状況