RDF description of 在宅診療・療養支援の有無
primary topic: 在宅診療・療養支援の有無

在宅診療・療養支援の有無
type: TerminologyConcept
description: 直接の対面診療を行うことが困難な患者や、直近まで相当期間にわたって診療を継続してきた慢性期疾患の患者など病状が安定している患者に対し、あらかじめ十分な説明を行い、理解を得た上で、医療機関から患者に貸し出されたテレビ電話等の画面を通じて医師と患者（またはその看護に当たっている者）とで会話をし、患者の表情や状態・皮膚の色合いの観察や診療等を行うものの体制の有無。医療施設から患者に貸し出された装置等により、在宅での心電図や血圧・体温・呼吸数等の健康データを医療施設に送信して健康管理を行うものを含む。
created: 2017-12-01
broader: Ta00640
in scheme: TerminologyConceptScheme
top concept of: TerminologyConceptScheme