RDF description of 材料費
primary topic: 材料費

材料費
type: TerminologyConcept
description: 工事のために直接購入した素材、半製品、製品、材料貯蔵品勘定等から振り替えられた材料費。仮設材料の損耗額等を含む。
created: 2017-12-01
broader: Ta00100
in scheme: TerminologyConceptScheme
top concept of: TerminologyConceptScheme