医局員数
type: TerminologyConcept
description: 医学部等に所属し、大学附属病院及び関連施設において診療、研究、教育に従事している医師の数。学校に対して授業料等を納めている者は除く。
created: 2017-12-01
broader: Ta00116
top concept of: TerminologyConceptScheme
in scheme: TerminologyConceptScheme

RDF description of 医局員数
primary topic: 医局員数