新規採用研究者数
type: TerminologyConcept
description: 一定の期間中に企業、非営利団体・公的機関、大学等に新卒で採用された者のうち、研究者の数。ただし、大学等にあっては、本務教員、医局員及びその他の研究員の数。研究とは、事物、機能、現象などについて新知識を得るために、又は既存の知識の新しい活用の道を開くために行われる創造的な努力及び探求をいい、いわゆる学術的な研究のみならず、製品開発、既存製品の改良及び生産・製造工程の開発や改良に関する活動も含む。研究者とは、大学（短期大学を除く。）の課程を修了した者又はこれと同等以上の専門的知識を有する者で、特定のテーマを持って研究を行っている者をいう。大学等以外の研究部門の管理者は、研究者としての経験がある者は含み、そうでない者は除く。また、ソフトウェア開発者のうち、システム設計、プログラム構造定義など、製品又はその一部を考案・設計する立場の者を含む。本務教員、医局員及びその他の研究員とは、教授、准教授、助教、講師、助手など、医局員を含む調査対象である大学等に本務がある研究者のうち、大学院博士課程在学者及び学校に対して授業料等を納めている者を除いたものをいう。新卒で採用された者（研究者）には、最終学歴を修了してすぐに採用された者のほか、最終学歴修了後、パート・アルバイト、大学や研究機関の臨時職員としての雇用などの経験のみの者を含む。
created: 2017-12-01
broader: Ta00116
top concept of: TerminologyConceptScheme
in scheme: TerminologyConceptScheme

RDF description of 新規採用研究者数
primary topic: 新規採用研究者数