受入電力量
type: TerminologyConcept
description: 受入量を電力量の単位（kWなど）で表したもの。受入れとは、工場及び工場が契約の主体となって借り受けている倉庫又は保管場所に次の事由により受け入れること。他企業からの購入（輸入を含む。）、同一企業内の他工場からの受入れ（輸入を含む。）、委託生産品及び委託加工品の委託先の工場（下請工場を含む。）からの受入れ、廃棄品を除く返品（戻入れ）。
created: 2017-12-01
broader: Ta00678
top concept of: TerminologyConceptScheme
in scheme: TerminologyConceptScheme

RDF description of 受入電力量
primary topic: 受入電力量