がん検診の受診理由
type: TerminologyConcept
description: 過去１年間に受診したがん検診は、勤め先（家族の勤め先を含む）からのお知らせで受けたか否か。（健診等（健康診断、健康診査及び人間ドック）の中で受診したものも含む。）
created: 2017-12-01
broader: Ta00635
top concept of: TerminologyConceptScheme
in scheme: TerminologyConceptScheme

RDF description of がん検診の受診理由
primary topic: がん検診の受診理由