RDF description of 震災による避難の有無
primary topic: 震災による避難の有無

震災による避難の有無
type: TerminologyConcept
in scheme: TerminologyConceptScheme
top concept of: TerminologyConceptScheme
broader: Ta00658
created: 2017-12-01
description: 震災の影響で、避難所や親戚・知人宅、仮設住宅などにおける生活を強いられたかどうかの別。なお、単に危険を回避できる場所に一時的に避難した場合、帰宅困難者が交通機関の回復を待つために待機施設などへ一時的に避難した場合は含まない。