育児の状況
type: TerminologyConcept
description: ふだん育児をしているかどうかの別。ここでいう育児の対象は、未就学児（小学校入学前の幼児）であり、孫やおい・めい、弟妹の世話などは育児の対象には含まない。なお、ここでいう育児とは、乳児のおむつの取り替え、乳幼児の世話や見守り、就学前の子どもの送迎・つきそい・見守りや勉強・遊び・習い事などの練習の相手・保護者会への出席などをいう。
created: 2017-12-01
broader: Ta00658
top concept of: TerminologyConceptScheme
in scheme: TerminologyConceptScheme

RDF description of 育児の状況
primary topic: 育児の状況