雇用契約期間
type: TerminologyConcept
description: 1回当たりの雇用契約期間。同じ事業所で、契約期間の更新を繰り返しながら働いている人は、最初に契約したときからの通算ではなく、現在の雇用期間。なお、知事、市区町村長、議会の議員などの場合、任期を雇用契約期間とみなす。
created: 2017-12-01
broader: Ta00350
top concept of: TerminologyConceptScheme
in scheme: TerminologyConceptScheme

RDF description of 雇用契約期間
primary topic: 雇用契約期間