非正規就業の理由
type: TerminologyConcept
description: 勤め先での呼称が非正規の職員・従業員に分類される者が、現在の雇用形態を選んだ理由。
created: 2017-12-01
broader: Ta00532
in scheme: TerminologyConceptScheme
narrower: si188020005
narrower: si188020004
top concept of: TerminologyConceptScheme

RDF description of 非正規就業の理由
primary topic: 非正規就業の理由