RDF description of 外部支出研究費
primary topic: 外部支出研究費

外部支出研究費
type: TerminologyConcept
description: 外部の企業、非営利団体・公的機関、大学等へ、研究を行わせることを目的として支出した費用（委託費、賦課金等のいかんを問わない）。ただし、内部における研究の一部として外部へ委託する試作品の製作や試験・検査などの費用は含まない。
created: 2017-12-01
broader: Ta00080
in scheme: TerminologyConceptScheme
top concept of: TerminologyConceptScheme