研究関係業務に従事した割合であん分した技能者数
type: TerminologyConcept
description: 企業、非営利団体・公的機関で実際に研究関係業務に従事している技能者の数に、業務のうち研究関係業務に従事した時間の割合を乗じた人数。研究とは、事物、機能、現象などについて新知識を得るために、又は既存の知識の新しい活用の道を開くために行われる創造的な努力及び探求をいい、いわゆる学術的な研究のみならず、製品開発、既存製品の改良及び生産・製造工程の開発や改良に関する活動も含む。技能者とは、研究者及び研究補助者以外の者で、研究者又は研究補助者の指導及び監督の下に研究に付随する専門的な技術サービスを行っている者をいう。実際に研究関係業務に従事している技能者には、他の法人、団体など（以下「法人等」という。）から派遣されている者（労働者派遣法にいう派遣労働者）、在籍出向など、他の法人等に籍がありながら当該法人等に来て働いている者のうち、技能者を含む。他の法人等へ派遣している者（労働者派遣法にいう派遣労働者）、在籍出向など当該法人等に籍がありながら他の法人等で働いている者は除く。技能者の具体例として、検査・測定専門の技師、無菌動物の飼育に従事している者、試験用材料の作成・加工に従事している者などを含む。【平成25年2月 定義内容の変更】
created: 2017-12-01
broader: Ta00116
top concept of: TerminologyConceptScheme
in scheme: TerminologyConceptScheme

RDF description of 研究関係業務に従事した割合であん分した技能者数
primary topic: 研究関係業務に従事した割合であん分した技能者数