販売消費重量
type: TerminologyConcept
description: 販売量、消費量を重量の単位（g、kg、t、鉛量t、純分換算kg、絶乾t、導体tなど）で表したもの。販売とは、販売業者又は消費者である他企業に直接販売したもの、販売することを目的として本社・営業所又は中継所等（これが契約の主体となって借り受けている倉庫などを含む。）に出荷したもの、受託生産品を販売業者である委託者へ出荷したもの、同一調査品目を生産していない同一企業内の他工場へ出荷したもの（全くの転売品）のことである。ただし、返品があった場合はその数量を差し引く。消費とは、事業所及び工場で生産した製品並びに他からの受入品の、他の製品の原材料又は加工品用としての自家消費（自己消費）を指す。ただし、当該調査票が対象としている事業のために消費したものに限り、事業所が他の業務を兼業し、その業務を行うために消費したものは除く。また、自工場施設などへの設備投資、見本用、贈答用、展示用、試験研究用などの自家使用は含まない。
created: 2017-12-01
broader: Ta00288
top concept of: TerminologyConceptScheme
in scheme: TerminologyConceptScheme

RDF description of 販売消費重量
primary topic: 販売消費重量