RDF description of 一般財団法人数
primary topic: 一般財団法人数

一般財団法人数
type: TerminologyConcept
in scheme: TerminologyConceptScheme
top concept of: TerminologyConceptScheme
broader: Ta00380
created: 2017-12-01
description: 都道府県教育委員会が所管する生涯学習又は社会教育の振興を目的として設置されている一般財団法人の数。