手術時期_1
type: TerminologyConcept
description: 手術を行った時期。入院中に複数回手術を行った場合は、診療報酬の高い手術の手術日を、診療報酬が同じ場合は、先に行った手術の手術日とする。手術が二日以上に続けて行われた場合、初日を手術の時期とする。手術の種類は、開頭手術、開胸手術、開腹手術、筋骨格系手術（四肢体幹）、腹腔鏡下手術、胸腔鏡下手術、その他の内視鏡下手術、経皮的血管内手術、その他とする。ただし、分娩時の会陰部切開は含まない。
created: 2017-12-01
broader: Ta00339
top concept of: TerminologyConceptScheme
in scheme: TerminologyConceptScheme

RDF description of 手術時期_1
primary topic: 手術時期_1