非常勤の歯科衛生士の常勤換算数
type: TerminologyConcept
description: 施設が直接雇い入れた者、派遣労働者、出向者、一般の従事者と同様の勤務状況にある家族従事者のうち、常勤以外の歯科衛生士について、その施設で定めた１週間の勤務時間により常勤に換算した歯科衛生士の数。歯科衛生士とは、歯科衛生士の免許を有し、主として歯牙及び口腔の疾患予防処置などの業務を担当している者をいう。
created: 2017-12-01
broader: Ta00119
in scheme: TerminologyConceptScheme
top concept of: TerminologyConceptScheme

RDF description of 非常勤の歯科衛生士の常勤換算数
primary topic: 非常勤の歯科衛生士の常勤換算数