インプラント手術の実施件数
type: TerminologyConcept
description: インプラント手術の実施件数。インプラント手術とは、欠損あるいは傷害を生じた歯の補綴、修復のために体内に埋入される手術をいう。
created: 2017-12-01
broader: Ta00402
in scheme: TerminologyConceptScheme
top concept of: TerminologyConceptScheme

RDF description of インプラント手術の実施件数
primary topic: インプラント手術の実施件数