RDF description of 院内助産所の有無
primary topic: 院内助産所の有無

院内助産所の有無
type: TerminologyConcept
in scheme: TerminologyConceptScheme
top concept of: TerminologyConceptScheme
broader: Ta00644
created: 2017-12-01
description: 院内助産所の設置の有無。院内助産所とは、患者の緊急時対応ができる医療施設において、正常経過の妊産婦のケア及び助産を助産師が自立して行うものをいう。