専門外来の設置の有無
type: TerminologyConcept
description: 外来診療における「禁煙外来」、「助産師外来」の設置の有無。助産師外来とは、医療機関において、外来で、正常経過の妊産婦の健康診査と保健指導を助産師が自立して行うものをいう。
created: 2017-12-01
broader: Ta00640
top concept of: TerminologyConceptScheme
in scheme: TerminologyConceptScheme

RDF description of 専門外来の設置の有無
primary topic: 専門外来の設置の有無