退院後の病院・診療所の所在地
type: TerminologyConcept
description: 当該医療施設における患者の退院後の居場所が他の病院・診療所であった場合のその所在地。
created: 2017-12-01
broader: Ta00511
top concept of: TerminologyConceptScheme
in scheme: TerminologyConceptScheme

RDF description of 退院後の病院・診療所の所在地
primary topic: 退院後の病院・診療所の所在地