RDF description of 入院の状況
primary topic: 入院の状況

入院の状況
type: TerminologyConcept
description: 当該医療施設における入院患者の状況をいい、「生命の危険は少ないが入院治療を要する」、「生命の危険がある」、「受け入れ条件が整えば退院可能」、「検査入院」、「その他」に区分している。【平成23年10月 定義内容の一部を変更】
created: 2017-12-01
broader: Ta00633
in scheme: TerminologyConceptScheme
top concept of: TerminologyConceptScheme