来院時の状況
type: TerminologyConcept
description: 当該医療施設における患者の来院時の状況をいい、通常に受診したもの、救急車で搬送され受診したもの、徒歩や自家用車等で来院し救急で受診したものをいう。
created: 2017-12-01
broader: Ta00632
in scheme: TerminologyConceptScheme
top concept of: TerminologyConceptScheme

RDF description of 来院時の状況
primary topic: 来院時の状況