RDF description of 育児の手助けの有無
primary topic: 育児の手助けの有無

育児の手助けの有無
type: TerminologyConcept
in scheme: TerminologyConceptScheme
top concept of: TerminologyConceptScheme
broader: Ta00504
created: 2017-12-01
description: ふだん世帯員以外の人から育児の手助けを受けているかどうかの別。またその担い手の種類。