勤務形態
type: TerminologyConcept
description: 勤務形態を労働時間制（フルタイムか短時間勤務か、裁量労働制、フレックスタイム制、交替制勤務など）によって区分したもの。
created: 2017-12-01
broader: Ta00525
top concept of: TerminologyConceptScheme
in scheme: TerminologyConceptScheme

RDF description of 勤務形態
primary topic: 勤務形態