卸売・小売・宿泊・飲食サービスの品目
type: TerminologyConcept
description: 卸売、小売した商品又は飲食、宿泊の品目（品物の種類別の項目）。【平成22年３月 日本標準産業分類第12回改定に伴い、定義単位項目名を変更】
created: 2017-12-01
broader: Ta00581
top concept of: TerminologyConceptScheme
in scheme: TerminologyConceptScheme

RDF description of 卸売・小売・宿泊・飲食サービスの品目
primary topic: 卸売・小売・宿泊・飲食サービスの品目