RDF description of 時間数生産能力
primary topic: 時間数生産能力

時間数生産能力
type: TerminologyConcept
description: 調査対象である製品を生産するための機械の月間延運転錘時間数又は操業時間。月間延運転錘時間数とは、調査期間中に各スピンドルの実際に運転した延運転錘時間のことである。操業時間とは、工場における１日の平均操業時間×月間操業日数で求める。【平成23年２月 定義内容の変更】
created: 2017-12-01
broader: Ta00362
in scheme: TerminologyConceptScheme
top concept of: TerminologyConceptScheme