RDF description of 企業の設立形態
primary topic: 企業の設立形態

企業の設立形態
type: TerminologyConcept
in scheme: TerminologyConceptScheme
top concept of: TerminologyConceptScheme
broader: Ta00575
created: 2017-12-01
description: 企業の設立の形態。企業の設立形態とは、企業が設立された際の形態（新規、合併、分割等）をいう。【平成22年３月 定義内容の変更】