RDF description of 減少関連会社数
primary topic: 減少関連会社数

減少関連会社数
type: TerminologyConcept
in scheme: TerminologyConceptScheme
top concept of: TerminologyConceptScheme
broader: Ta00381
created: 2017-12-01
description: 閉鎖・廃業、統合、売却等により減少した関連会社数。関連会社とは、当該会社が20％以上～50％以下の議決権を所有している会社をいう。また、15％以上議決権を所有していること等により、重要な影響を与えることができる会社を含む。