減少子会社数
type: TerminologyConcept
description: 閉鎖・廃業、統合、売却等により減少した子会社数。子会社とは、当該会社が50％超の議決権を所有する会社をいう。なお、当該会社の子会社又は当該会社とその子会社合計で50％超の議決権を所有している会社を含む。50％以下であっても当該会社が経営を実質的に支配している会社も含む。
created: 2017-12-01
broader: Ta00381
top concept of: TerminologyConceptScheme
in scheme: TerminologyConceptScheme

RDF description of 減少子会社数
primary topic: 減少子会社数