指導教諭数
type: TerminologyConcept
description: 指導教諭として発令されている者の数。指導教諭とは、児童・生徒の教育又は幼児の保育をつかさどり、並びに教諭その他の職員に対して、教育指導の改善及び充実のために必要な指導及び助言を行う者をいう。
created: 2017-12-01
broader: Ta00122
in scheme: TerminologyConceptScheme
top concept of: TerminologyConceptScheme

RDF description of 指導教諭数
primary topic: 指導教諭数