サービス取引の支払金額
type: TerminologyConcept
description: 運輸、通信、建設、保険、金融、情報、ソフト、文化、興行等の各種サービス、特許権等使用料等の取引による支払金額。
created: 2017-12-01
broader: Ta00072
top concept of: TerminologyConceptScheme
in scheme: TerminologyConceptScheme

RDF description of サービス取引の支払金額
primary topic: サービス取引の支払金額