RDF description of 増加関連会社数
primary topic: 増加関連会社数

増加関連会社数
type: TerminologyConcept
description: 新規設立、分社化、買収等により増加した関連会社数。関連会社とは、当該会社が20％以上～50％以下の議決権を所有している会社をいう。また、15％以上議決権を所有していること等により、重要な影響を与えることができる会社を含む。
created: 2017-12-01
broader: Ta00381
in scheme: TerminologyConceptScheme
top concept of: TerminologyConceptScheme