子会社・関連会社の有無
type: TerminologyConcept
description: 子会社・関連会社の有無。子会社とは、当該会社が50％超の議決権を所有する会社をいう。なお、当該会社の子会社又は当該会社とその子会社合計で50％超の議決権を所有している会社を含む。50%以下であっても当該会社が経営を実質的に支配している会社も含む。関連会社とは、当該会社が20％以上～50％以下の議決権を所有している会社をいう。また、15％以上議決権を所有していること等により、重要な影響を与えることができる会社を含む。
created: 2017-12-01
broader: Ta00574
top concept of: TerminologyConceptScheme
in scheme: TerminologyConceptScheme

RDF description of 子会社・関連会社の有無
primary topic: 子会社・関連会社の有無