副校（園）長数
type: TerminologyConcept
description: 副校（園）長として発令されている者の数。副校（園）長とは、校長（又は園長。以下同じ。）を助け、命を受けて校務（又は園務）をつかさどり、校長に事故があるときはその職務を代理し、校長が欠けたときはその職務を行う者をいう。
created: 2017-12-01
broader: Ta00122
in scheme: TerminologyConceptScheme
top concept of: TerminologyConceptScheme

RDF description of 副校（園）長数
primary topic: 副校（園）長数