RDF description of 組織再編行為の内容
primary topic: 組織再編行為の内容

組織再編行為の内容
type: TerminologyConcept
description: 組織再編行為の内容。組織再編行為とは、既存企業における吸収合併、分社化等の行為をいう。
created: 2017-12-01
broader: Ta00575
in scheme: TerminologyConceptScheme
top concept of: TerminologyConceptScheme