RDF description of 児童手当等の受給額
primary topic: 児童手当等の受給額

児童手当等の受給額
type: TerminologyConcept
description: 児童手当、児童扶養手当、特別児童扶養手当、児童育成手当などの児童に関する社会保障給付金の受給額。
created: 2017-12-01
broader: Ta00012
in scheme: TerminologyConceptScheme
top concept of: TerminologyConceptScheme