保健指導勧めの有無
type: TerminologyConcept
description: 過去１年間に健診等（健康診断、健康診査及び人間ドック）を受診したことがあり、かつ、健診等の結果、何らかの指摘を受け、生活習慣の改善に関して専門家（医師、保健師、又は管理栄養士等）のアドバイス（保健指導）を受けるように勧められたか否か。
created: 2017-12-01
broader: Ta00635
top concept of: TerminologyConceptScheme
in scheme: TerminologyConceptScheme

RDF description of 保健指導勧めの有無
primary topic: 保健指導勧めの有無