フランチャイズ加盟の有無
type: TerminologyConcept
description: フランチャイズチェーンへの加盟の有無。「フランチャイズ」とは事業者（「フランチャイザー」と呼ぶ）が他の事業者（「フランチャイジー」と呼ぶ）との間に契約を結び、自己の商標、サービスマーク、トレード・ネームその他の営業の象徴となる標識、および経営のノウハウを用いて、同一イメージのもとに商品の販売その他の事業を行う権利を与え、一方、フランチャイジーはその見返りとして一定の対価を支払い、事業に必要な資金を投下してフランチャイザーの指導および援助のもとに事業を行う両者の継続的関係。
created: 2017-12-01
broader: Ta00539
top concept of: TerminologyConceptScheme
in scheme: TerminologyConceptScheme

RDF description of フランチャイズ加盟の有無
primary topic: フランチャイズ加盟の有無