外来化学療法室病床数
type: TerminologyConcept
description: 「特掲診療料の施設基準等」（平成20年厚生労働省告示第63号）の第八の一 外来化学療法加算の施設基準を満たしている、外来患者に対し悪性腫瘍の治療を目的とした抗腫瘍薬等を投与するための治療室の専用ベッド台数。
created: 2017-12-01
broader: Ta00462
in scheme: TerminologyConceptScheme
top concept of: TerminologyConceptScheme

RDF description of 外来化学療法室病床数
primary topic: 外来化学療法室病床数